Número,URL,Estado,Entidad,Descripción,Dependencia,Unidad de Compra,Dirección,Tipo de Procedimiento,Objeto Contractual,Última Búsqueda,Fecha de Publicación,Fecha y Hora Presentación de Propuestas,Fecha y Hora de Apertura de Propuestas,Lugar de presentación de propuestas,Precio Referencia,Partidas presupuestales - Número 1,Partidas presupuestales - Número 2,Partidas presupuestales - Número 3,Programa,Modalidad de adjudicación,Provincia de Entrega,Nombre,Cargo,Teléfono,Correo Electrónico,Nombre,Número de Identificación,Dirección,Provincia,Distrito,Correo Electrónico,Teléfono
2008-0-03-0-08-CM-007679,http://panamacompra.gob.pa/Inicio/#!/vistaPreviaCP?NumLc=2008-0-03-0-08-CM-007679,Adjudicado,Ministerio De La Presidencia,APOYO ECONOMICO PARA CUBRIR COSTO DE EXAMEN MEDICO QUE REQUIERE LA SEÑORA MALGIA ESTHER CRUZ PEREZ,SEDE,,,"Compra Menor de B/. 1,000",Bien,19-10-2017,04-08-2008 09:46 AM,,,,,,,,---,Global,PANAMÁ,Mara Barrios,Cotizador,,,PATRONATO DEL HOSPITAL SANTO TOMAS,J-8-NT-1-23384-53,AVE. BALBOA PANAMA,PANAMÁ,Panamá,stomas@hotmail.com,527-9600
2008-0-03-0-08-CM-007678,http://panamacompra.gob.pa/Inicio/#!/vistaPreviaCP?NumLc=2008-0-03-0-08-CM-007678,Adjudicado,Ministerio De La Presidencia,APOYO ECONOMICO PARA EL SUMINISTRO DE COLCHON SEMIORTOPEDICO QUE REQUIERE EL SEÑOR MARIANO COMBE MUÑOZ,SEDE,,,"Compra Menor de B/. 1,000",Bien,19-10-2017,04-08-2008 09:46 AM,,,,,,,,---,Global,PANAMÁ,Mara Barrios,Cotizador,,,"GULKAVI, S.A.",805891-1-496498-,CENTRO COMERCIAL LOS PUEBLOS,PANAMÁ,Panamá,gulkavi@hotmail.com,217-8843
2008-0-03-0-08-CM-007677,http://panamacompra.gob.pa/Inicio/#!/vistaPreviaCP?NumLc=2008-0-03-0-08-CM-007677,Adjudicado,Ministerio De La Presidencia,APOYO ECONOMICO PARA EL SUMINISTRO DE MEDICAMENTOS QUE REQUIERE EL SEÑOR MARIANO COMBE MUÑOZ,SEDE,,,"Compra Menor de B/. 1,000",Bien,19-10-2017,04-08-2008 09:47 AM,,,,,,,,---,Global,PANAMÁ,Mara Barrios,Cotizador,,,BOTICA EL JAVILLO,270-35-61112-23,Urbanizacion El Paical Calle Ricardo J. Alfaro Edison Plaza Local 16,PANAMÁ,Panamá,bplazaedison@grupodehaseth.com,507-3014005
2008-0-03-0-08-CM-007676,http://panamacompra.gob.pa/Inicio/#!/vistaPreviaCP?NumLc=2008-0-03-0-08-CM-007676,Adjudicado,Ministerio De La Presidencia,APOYO ECONOMICO PARA EL SUMINISTRO DE MEDICAMENTOS QUE REQUIERE LA SEÑORA FELIPA MAGALLON DE PEREZ CON DISCAPACIDAD,SEDE,,,"Compra Menor de B/. 1,000",Bien,19-10-2017,04-08-2008 09:48 AM,,,,,,,,---,Global,PANAMÁ,Mara Barrios,Cotizador,,,"INMOBILIARIA DON ANTONIO, S.A.",240563-30815-22-38,LA LOCERIA RICARDO ALFARO TAGAROPULOS,PANAMÁ,Panamá,bonos@smrey.com,270-5555/00
2008-0-03-0-08-CM-007675,http://panamacompra.gob.pa/Inicio/#!/vistaPreviaCP?NumLc=2008-0-03-0-08-CM-007675,Adjudicado,Ministerio De La Presidencia,"COMPRA DE UN TERMOMETRO, SOLICITADO POR LA CLINICA PRESIDENCIAL.",SEDE,,,"Compra Menor de B/. 1,000",Bien,19-10-2017,08-08-2008 10:14 AM,,,,,,,,---,Global,PANAMÁ,Edisa Cuesta,Cotizador,527-9850,ecuesta@presidencia.gob.pa,"Hogar y Salud (Mediequipos, S.A.)",19220-118-175433-15,"Via Israel y Calle 71, San Francisco",PANAMÁ,Panamá,rnoriega@hogarysalud.net,507-2701444
2008-0-03-0-08-CM-007674,http://panamacompra.gob.pa/Inicio/#!/vistaPreviaCP?NumLc=2008-0-03-0-08-CM-007674,Adjudicado,Ministerio De La Presidencia,APOYO ECONOMICO PARA EL SUMINISTRO DE INSUMOS REQUERIDOS POR ESTUDIANTES DE LA CARRERA DE LIC. EN NUTRICION Y DIETETICA DE LA FAC. DE MEDICINA,SEDE,,,"Compra Menor de B/. 1,000",Bien,19-10-2017,01-08-2008 12:29 PM,,,,,,,,---,Global,PANAMÁ,Mara Barrios,Cotizador,,,LIBRERIA DIDÁCTICA,262-494-6580-54,"Urbanizacion Obarrio, Calle Santa Rita, Cond. Juan Franco No. 8",PANAMÁ,Panamá,jmate@cableonda.net,507-2647484
2008-0-03-0-08-CM-007673,http://panamacompra.gob.pa/Inicio/#!/vistaPreviaCP?NumLc=2008-0-03-0-08-CM-007673,Adjudicado,Ministerio De La Presidencia,COMPRA DE ALIMENTOS SOLICITADO POR SALONERIA.,SEDE,,,"Compra Menor de B/. 1,000",Bien,19-10-2017,26-08-2008 08:59 AM,,,,,,,,---,Global,PANAMÁ,Edisa Cuesta,Cotizador,527-9850,ecuesta@presidencia.gob.pa,"THE GOURMET CONNECTION , INC",650233-1-459535-50,"AVE. JOSE DE FABREGA CALLE II , EDIF. TERRAZAS D ELA CRESTA LOCAL 1",PANAMÁ,Panamá,infogourmet@cwpanama.net,507-2132253
2008-0-03-0-08-CM-007672,http://panamacompra.gob.pa/Inicio/#!/vistaPreviaCP?NumLc=2008-0-03-0-08-CM-007672,Adjudicado,Ministerio De La Presidencia,"DISPENSADOR DE AGUA CON SUS REPUESTOS, SOLICITADO POR BIENES PATRIMONIALES.",SEDE,,,"Compra Menor de B/. 1,000",Bien,19-10-2017,30-10-2008 08:44 AM,,,,,,,,---,Global,PANAMÁ,Edisa Cuesta,Cotizador,527-9850,ecuesta@presidencia.gob.pa,"AGUAS CRISTALINAS, S. A.",18219-85-169844-29,"corregimiento de Bethania, calle C, urbanización Industrial La Locería, planta baja.",PANAMÁ,Panamá,aquacristalina@aquacristalina.com,2605644
2008-0-03-0-08-CM-007671,http://panamacompra.gob.pa/Inicio/#!/vistaPreviaCP?NumLc=2008-0-03-0-08-CM-007671,Adjudicado,Ministerio De La Presidencia,COMPRA DE BATERIA,SEDE,,,"Compra Menor de B/. 1,000",Bien,19-10-2017,02-12-2008 11:27 AM,,,,,,,,---,Global,PANAMÁ,Edisa Cuesta,Cotizador,527-9850,ecuesta@presidencia.gob.pa,"PRODUCTOS SUPERIORES,S.A.",186-505-46878-80,"edificio 401-402,boulevard andrews,albrook",PANAMÁ,Panamá,jjordan@supropanama.com,507-3003800
2008-0-03-0-08-CM-007670,http://panamacompra.gob.pa/Inicio/#!/vistaPreviaCP?NumLc=2008-0-03-0-08-CM-007670,Adjudicado,Ministerio De La Presidencia,"SERVICIO DE HOSPEDAJE Y ALIMENTO, SOLICITADO POR EL MINSA.",SEDE,,,"Compra Menor de B/. 1,000",Servicio,19-10-2017,05-08-2008 08:42 AM,,,,,,,,---,Global,PANAMÁ,Edisa Cuesta,Cotizador,527-9850,ecuesta@presidencia.gob.pa,HOTEL ROMA PLAZA,14760-50-143364-10,"AVE. JUSTO AROSEMENA, CALLE 33",PANAMÁ,Panamá,reservas@hotelromaplaza.com,227-3844
2008-0-03-05-01-CM-000239,http://panamacompra.gob.pa/Inicio/#!/vistaPreviaCP?NumLc=2008-0-03-05-01-CM-000239,Adjudicado,Ministerio De La Presidencia,"SUMINISTRO DE MATERIALES DE CONSTRUCCIÓN PARA MEJORAS AL COMEDOR DE LA ESCUELA BAJO CEDRO, DISTRITO DE CHIRIQUÍ GRANDE, PROVINCIA DE BOCAS DEL TORO.",FONDO DE INVERSION SOCIAL,,,"Compra Menor entre B/. 5,000 y B/. 30,000",Bien,19-10-2017,22-07-2008 03:51 PM,,,,"7,087.45",0.03.1.1.703.02.02.259,,,---,Global,BOCAS DEL TORO,HORACIO MADRID,COTIZADOR,507-9018,hmadrid@fis.gob.pa,,,,,,,
2008-0-03-05-01-CM-000238,http://panamacompra.gob.pa/Inicio/#!/vistaPreviaCP?NumLc=2008-0-03-05-01-CM-000238,Adjudicado,Ministerio De La Presidencia,"SUMINISTRO DE MATERIALES DE CONSTRUCCIÓN PARA MEJORAS AL COMEDOR DE LA ESCUELA FINCA 41, DISTRITO DE CHANGUINOLA, PROVINCIA DE BOCAS DEL TORO",FONDO DE INVERSION SOCIAL,,,"Compra Menor entre B/. 5,000 y B/. 30,000",Bien,19-10-2017,17-07-2008 04:08 PM,,,,"7,438.91",0.03.1.1.703.02.02.259,,,---,Global,BOCAS DEL TORO,HORACIO MADRID,COTIZADOR,507-9018,hmadrid@fis.gob.pa,,,,,,,
2008-0-03-05-01-CM-000236,http://panamacompra.gob.pa/Inicio/#!/vistaPreviaCP?NumLc=2008-0-03-05-01-CM-000236,Adjudicado,Ministerio De La Presidencia,"SUMINISTRO DE MATERIALES DE CONSTRUCCIÓN PARA MEJORAS AL COMEDOR DE LA ESCUELA QUEBRADA PITTY, DISTRITO DE CHANGUINOLA, PROVINCIA DE BOCAS DEL TORO.",FONDO DE INVERSION SOCIAL,,,"Compra Menor entre B/. 5,000 y B/. 30,000",Bien,19-10-2017,18-07-2008 11:12 AM,,,,"8,086.08",0.03.1.1.703.02.02.259,,,---,Global,BOCAS DEL TORO,HORACIO MADRID,COTIZADOR,507-9018,hmadrid@fis.gob.pa,,,,,,,
2008-0-03-05-01-CM-000242,http://panamacompra.gob.pa/Inicio/#!/vistaPreviaCP?NumLc=2008-0-03-05-01-CM-000242,Adjudicado,Ministerio De La Presidencia,"SUMINISTRO DE UTENCILIOS DE COCINA PARA LAS ESCUELAS DEL PROGRAMA DE NUTRICIÓN UBICADAS EN LOS DISTRITOS DE CHANGUINOLA, BOCAS DEL TORO(ISLA) Y CHIRIQUÍ GRANDE DE LA PROVINCIA DE BOCAS DEL TORO",FONDO DE INVERSION SOCIAL,,,"Compra Menor entre B/. 5,000 y B/. 30,000",Bien,19-10-2017,17-07-2008 04:23 PM,,,,"5,300.00",0.03.1.1.703.02.02.271,,,---,Global,BOCAS DEL TORO,HORACIO MADRID,COTIZADOR,507-9018,hmadrid@fis.gob.pa,,,,,,,
2008-0-03-05-08-CM-000245,http://panamacompra.gob.pa/Inicio/#!/vistaPreviaCP?NumLc=2008-0-03-05-08-CM-000245,Adjudicado,Ministerio De La Presidencia,"SUMINISTRO DE DIECIOCHO (18) TANQUES DE 5 GALONES DE PINTURA DE COLOR ROJO, BLANCO, AZUL Y AMARILLO, PARA SER DONADOS POR EL DESPACHO DE LA PRIMERA DAMA A LA ESCUELA LOS OLIVOS, CORREGIMIENTO LOS OLIVOS, DISTRITO DE LOS SANTOS, PROVINCIA DE LOS SANTOS.",FONDO DE INVERSION SOCIAL,,,"Compra Menor entre B/. 1,000 y B/. 5,000",Bien,19-10-2017,16-07-2008 04:16 PM,,,,"1,550.00",0.03.1.1.002.50.01.243,,,---,Global,PANAMÁ,HORACIO MADRID,COTIZADOR,507-9018,hmadrid@fis.gob.pa,,,,,,,
2008-0-03-05-08-CM-000243,http://panamacompra.gob.pa/Inicio/#!/vistaPreviaCP?NumLc=2008-0-03-05-08-CM-000243,Adjudicado,Ministerio De La Presidencia,SUMINISTRO DE CIEN (100) TUBOS GALVANIZADOS DE 1 1/2 X 20' CAL 16 .,FONDO DE INVERSION SOCIAL,,,"Compra Menor entre B/. 1,000 y B/. 5,000",Bien,19-10-2017,17-07-2008 04:14 PM,,,,"3,097.50",0.03.1.1.001.21.01.256,,,---,Global,PANAMÁ,HORACIO MADRID,COTIZADOR,507-9018,hmadrid@fis.gob.pa,,,,,,,
2008-0-03-0-08-CM-007488,http://panamacompra.gob.pa/Inicio/#!/vistaPreviaCP?NumLc=2008-0-03-0-08-CM-007488,Adjudicado,Ministerio De La Presidencia,SERVICIOS DE DECORACION,SEDE,,,"Compra Menor de B/. 1,000",Servicio,19-10-2017,11-08-2008 09:05 AM,,,,,,,,---,Global,PANAMÁ,guillermo Rivas Bonilla,cotizador,527-9862,,MUNI'S -BUQUET,9-118-932-,CALLE IERA LA FRONOZA SANTIAGO VERAGUAS,PANAMÁ,Panamá,MUNISBUQUET@HOTMAIL.COM,998-2002
2008-0-03-0-08-CM-007489,http://panamacompra.gob.pa/Inicio/#!/vistaPreviaCP?NumLc=2008-0-03-0-08-CM-007489,Adjudicado,Ministerio De La Presidencia,PRODUCCION,SEDE,,,"Compra Menor de B/. 1,000",Servicio,19-10-2017,11-08-2008 09:19 AM,,,,,,,,---,Global,PANAMÁ,guillermo Rivas Bonilla,cotizador,527-9862,,EDDIE ARAUZ C,4-142-2413-,VIA PORRAS EDIF FRESCO BAY 4 A,PANAMÁ,Panamá,EDDIEARAUZC@HOTMAIL.COM,612-88-02
2008-0-03-0-08-CM-007320,http://panamacompra.gob.pa/Inicio/#!/vistaPreviaCP?NumLc=2008-0-03-0-08-CM-007320,Adjudicado,Ministerio De La Presidencia,COMPRA DE MOBILIARIO DE OFICINA,SEDE,,,"Compra Menor de B/. 1,000",Bien,19-10-2017,17-07-2008 02:02 PM,,,,,,,,---,Global,PANAMÁ,Edisa Cuesta,Cotizador,527-9850,ecuesta@presidencia.gob.pa,"OFIHOGAR, S.A.",54920-49-332181-50,PLAZA AMADOR ENTRE CALLE 16 Y 17,PANAMÁ,Panamá,ofihogarpanama@gmail.com,507-2287278
2008-0-03-0-08-CM-007484,http://panamacompra.gob.pa/Inicio/#!/vistaPreviaCP?NumLc=2008-0-03-0-08-CM-007484,Adjudicado,Ministerio De La Presidencia,COMPRA DE SUETERS Y GORRAS,SEDE,,,Compra Menor Apremiante,Bien,19-10-2017,18-07-2008 07:54 AM,,,,"2,100.00",003010010100120,,,---,Global,PANAMÁ,dauwer atencio,cotizador,522-0000,dawer2703@hotmail.es,,,,,,,
2008-0-03-0-08-CM-007485,http://panamacompra.gob.pa/Inicio/#!/vistaPreviaCP?NumLc=2008-0-03-0-08-CM-007485,Adjudicado,Ministerio De La Presidencia,PAGO POR SERVICIOS PRESTADOS,SEDE,,,"Compra Menor de B/. 1,000",Servicio,19-10-2017,22-07-2009 03:18 PM,,,,,,,,---,Global,PANAMÁ,Edisa Cuesta,Cotizador,527-9850,ecuesta@presidencia.gob.pa,JOSE DEL ROSARIO GONZALEZ / PAGADOR,9-124-2292-62,PRESIDENCIA,PANAMÁ,Panamá,,
2008-0-03-0-08-CM-007486,http://panamacompra.gob.pa/Inicio/#!/vistaPreviaCP?NumLc=2008-0-03-0-08-CM-007486,Adjudicado,Ministerio De La Presidencia,PAGO POR SERVICIOS PRESTADOS,SEDE,,,"Compra Menor de B/. 1,000",Servicio,19-10-2017,12-08-2008 01:58 PM,,,,,,,,---,Global,PANAMÁ,Edisa Cuesta,Cotizador,527-9850,ecuesta@presidencia.gob.pa,JOSE DEL ROSARIO GONZALEZ / PAGADOR,9-124-2292-62,PRESIDENCIA,PANAMÁ,Panamá,,
2008-0-03-0-08-CM-007487,http://panamacompra.gob.pa/Inicio/#!/vistaPreviaCP?NumLc=2008-0-03-0-08-CM-007487,Adjudicado,Ministerio De La Presidencia,BEBIDAS PARA USO DE LA SALONERIA EN ACTIVIDADES QUE SE REALIZAN EN EL PALACIO EN LA SEMANA DEL 8 DE JULIO DE 2008.,SEDE,,,"Compra Menor de B/. 1,000",Bien,19-10-2017,15-07-2009 08:40 AM,,,,,,,,---,Global,PANAMÁ,guillermo Rivas Bonilla,cotizador,527-9862,,"FELIPE E MOTTA E HIJO, S.A.",441-74-94389-76,"COSTA DEL ESTE, PARQUE INDUSTRIAL, AVENIDA A",PANAMÁ,Panamá,rmotta@felipemotta.com,-
2008-0-03-0-08-CM-007480,http://panamacompra.gob.pa/Inicio/#!/vistaPreviaCP?NumLc=2008-0-03-0-08-CM-007480,Adjudicado,Ministerio De La Presidencia,ALIMENTOS,SEDE,,,"Compra Menor de B/. 1,000",Bien,19-10-2017,11-08-2008 09:20 AM,,,,,,,,---,Global,PANAMÁ,guillermo Rivas Bonilla,cotizador,527-9862,,CLOVIS SAEZ,6-42-953-,Provicncia de Herrera,PANAMÁ,Panamá,csaez@hotmail.com,996-9696
2008-0-03-0-08-CM-007481,http://panamacompra.gob.pa/Inicio/#!/vistaPreviaCP?NumLc=2008-0-03-0-08-CM-007481,Adjudicado,Ministerio De La Presidencia,MANTENIMIENTO DE LOS VEHICULOS TOYOTA HILUX CON PLACA 007629 Y NISSAN FRONTIER 004009.,SEDE,,,"Compra Menor de B/. 1,000",Bien,19-10-2017,07-08-2008 11:07 AM,,,,,,,,---,Global,PANAMÁ,guillermo Rivas Bonilla,cotizador,527-9862,,"PRODUCTOS SUPERIORES,S.A.",186-505-46878-80,"edificio 401-402,boulevard andrews,albrook",PANAMÁ,Panamá,jjordan@supropanama.com,507-3003800
2008-0-03-0-08-CM-007482,http://panamacompra.gob.pa/Inicio/#!/vistaPreviaCP?NumLc=2008-0-03-0-08-CM-007482,Adjudicado,Ministerio De La Presidencia,SERVICIO DE ALIMENTACION,SEDE,,,"Compra Menor de B/. 1,000",Bien,19-10-2017,13-08-2008 11:13 AM,,,,,,,,---,Global,PANAMÁ,Gloria Jimenez,Jefa de Compras,527-9850,gjimenez@presidencia.gob.pa,EXQUISITECES,172990-1-390440-42,Camino Real Bethania PH. Eugenia,PANAMÁ,Panamá,dilanonil0413@hotmail.com,507-2517573
2008-0-03-0-08-CM-007483,http://panamacompra.gob.pa/Inicio/#!/vistaPreviaCP?NumLc=2008-0-03-0-08-CM-007483,Adjudicado,Ministerio De La Presidencia,ACCESORIOS DE PLATAS EN BAÑOS DE ORO,SEDE,,,"Compra Menor de B/. 1,000",Bien,19-10-2017,13-08-2008 11:15 AM,,,,,,,,---,Global,PANAMÁ,Gloria Jimenez,Jefa de Compras,527-9850,gjimenez@presidencia.gob.pa,joyeria la huaca,53472-9-327971-07,calle ricardo arias hotel continental planta baja local 6,PANAMÁ,Panamá,alessibrothers@hotmail.com,507-2697254
2008-0-03-0-08-CM-007428,http://panamacompra.gob.pa/Inicio/#!/vistaPreviaCP?NumLc=2008-0-03-0-08-CM-007428,Adjudicado,Ministerio De La Presidencia,RUTEADOR INHALAMBRICO,SEDE,,,"Compra Menor de B/. 1,000",Bien,19-10-2017,16-02-2009 09:57 AM,,,,,,,,---,Global,PANAMÁ,Edisa Cuesta,Cotizador,527-9850,ecuesta@presidencia.gob.pa,"Quick Service Supplies, S.A.",52887-52-326145-17,"Tumba Muerto, Plaza Aventura, Oficina 429 http://www.quickservicepanama.com",PANAMÁ,Panamá,gerencia@quickservicepanama.com,507-2600938
2008-0-03-0-08-CM-007272,http://panamacompra.gob.pa/Inicio/#!/vistaPreviaCP?NumLc=2008-0-03-0-08-CM-007272,Adjudicado,Ministerio De La Presidencia,SERVICIO PRESTADOS DE CABLE E INTERNET AL MINISTERIO DE LA PRESIDENCIA,SEDE,,,"Compra Menor de B/. 1,000",Servicio,19-10-2017,11-08-2008 08:27 AM,,,,,,,,---,Global,PANAMÁ,Edisa Cuesta,Cotizador,527-9850,ecuesta@presidencia.gob.pa,CABLE ONDA S.A.,30394-0002-238626-22,"AVENIDA 12 DE OCTUBRE, HATO PINTADO, PUEBLO NUEVO",PANAMÁ,Panamá,irecalde@cableonda.com,3907766
2008-0-03-0-08-CM-007270,http://panamacompra.gob.pa/Inicio/#!/vistaPreviaCP?NumLc=2008-0-03-0-08-CM-007270,Adjudicado,Ministerio De La Presidencia,REPUESTOS DE VEHICULO KIA CERATO PLACA 005990,SEDE,,,"Compra Menor de B/. 1,000",Bien,19-10-2017,17-07-2008 01:31 PM,,,,,,,,---,Global,PANAMÁ,Edisa Cuesta,Cotizador,527-9850,ecuesta@presidencia.gob.pa,"SILABA MOTORS, S.A.",31301-11-242424-01,CALLE 50,PANAMÁ,Panamá,ventascorporativas@silaba.com,507-2087997
2008-0-03-0-08-CM-007277,http://panamacompra.gob.pa/Inicio/#!/vistaPreviaCP?NumLc=2008-0-03-0-08-CM-007277,Adjudicado,Ministerio De La Presidencia,ALQUILER DE EQUIPOS PARA  LOS TRABAJOS DE REMODELACION,SEDE,,,"Compra Menor de B/. 1,000",Servicio,19-10-2017,22-07-2009 02:30 PM,,,,,,,,---,Global,PANAMÁ,Edisa Cuesta,Cotizador,527-9850,ecuesta@presidencia.gob.pa,casco s.a.,969997-1-529829-21,juan dias ave jose agustin arango antiguo banco continental,PANAMÁ,Panamá,info@cascosa.com,507-2173260
2008-0-03-0-08-CM-007276,http://panamacompra.gob.pa/Inicio/#!/vistaPreviaCP?NumLc=2008-0-03-0-08-CM-007276,Adjudicado,Ministerio De La Presidencia,ADQUISICION DE TINTAS Y TONERS,SEDE,,,"Compra Menor entre B/. 1,000 y B/. 5,000",Bien,19-10-2017,03-07-2008 10:32 AM,,,,"1,200.00",003010010100269 / 003010010103269,,,---,Global,PANAMÁ,Charles Alexis Loré,Oficinista,527-9850,clore@presidencia.gob.pa,,,,,,,
2008-0-03-0-08-CM-007275,http://panamacompra.gob.pa/Inicio/#!/vistaPreviaCP?NumLc=2008-0-03-0-08-CM-007275,Adjudicado,Ministerio De La Presidencia,SERVICIOS PRESTADOS DE CABLE E INTERNET,SEDE,,,"Compra Menor de B/. 1,000",Servicio,19-10-2017,19-08-2008 01:05 PM,,,,,,,,---,Global,PANAMÁ,Edisa Cuesta,Cotizador,527-9850,ecuesta@presidencia.gob.pa,CABLE ONDA S.A.,30394-0002-238626-22,"AVENIDA 12 DE OCTUBRE, HATO PINTADO, PUEBLO NUEVO",PANAMÁ,Panamá,irecalde@cableonda.com,3907766
2008-0-03-0-08-CM-007274,http://panamacompra.gob.pa/Inicio/#!/vistaPreviaCP?NumLc=2008-0-03-0-08-CM-007274,Adjudicado,Ministerio De La Presidencia,SERVICIOS PRESTADOS DE CABLE E INTERNET,SEDE,,,"Compra Menor de B/. 1,000",Servicio,19-10-2017,11-08-2008 08:31 AM,,,,,,,,---,Global,PANAMÁ,Edisa Cuesta,Cotizador,527-9850,ecuesta@presidencia.gob.pa,CABLE ONDA S.A.,30394-0002-238626-22,"AVENIDA 12 DE OCTUBRE, HATO PINTADO, PUEBLO NUEVO",PANAMÁ,Panamá,irecalde@cableonda.com,3907766
2008-0-03-0-08-CM-007279,http://panamacompra.gob.pa/Inicio/#!/vistaPreviaCP?NumLc=2008-0-03-0-08-CM-007279,Adjudicado,Ministerio De La Presidencia,CAJAS DE AGUA CRISTALINA DE 12 ONZ,SEDE,,,"Compra Menor de B/. 1,000",Bien,19-10-2017,17-07-2008 01:32 PM,,,,,,,,---,Global,PANAMÁ,Edisa Cuesta,Cotizador,527-9850,ecuesta@presidencia.gob.pa,"AGUAS CRISTALINAS, S. A.",18219-85-169844-29,"corregimiento de Bethania, calle C, urbanización Industrial La Locería, planta baja.",PANAMÁ,Panamá,aquacristalina@aquacristalina.com,2605644
2008-0-03-0-08-CM-007278,http://panamacompra.gob.pa/Inicio/#!/vistaPreviaCP?NumLc=2008-0-03-0-08-CM-007278,Adjudicado,Ministerio De La Presidencia,COMPRA DE ALIMENTOS PARA ACTIVIDADES QUE SE REALIZAN EN EL PALACIO EN LA SEMANA DEL 20 DE JUNIO 2008,SEDE,,,"Compra Menor de B/. 1,000",Bien,19-10-2017,22-07-2008 02:34 PM,,,,,,,,---,Global,PANAMÁ,Edisa Cuesta,Cotizador,527-9850,ecuesta@presidencia.gob.pa,DISTRIBUIDORA NEGUI,12863-81-127228-,CALLE EL AVANCE LOCAL 507-A BETANIA,PANAMÁ,Panamá,DISTRIBNEGUI@HOTMAIL.COM,229-3615
2008-0-03-0-08-CM-007440,http://panamacompra.gob.pa/Inicio/#!/vistaPreviaCP?NumLc=2008-0-03-0-08-CM-007440,Adjudicado,Ministerio De La Presidencia,ACTOS DE MAGIA PARA LA CELEBRACION DEL DIA DEL NIÑO,SEDE,,,"Compra Menor de B/. 1,000",Servicio,19-10-2017,04-08-2008 11:03 AM,,,,,,,,---,Global,PANAMÁ,Edisa Cuesta,Cotizador,527-9850,ecuesta@presidencia.gob.pa,JOSE ANTONIO GONZALEZ CAMPO,8-419-70-,CALLE ELIDA Nº10 EL CARMEN EDIFICIO TABASARA,PANAMÁ,Panamá,JOSEANTONIO@HOTMAIL.COM,66-972658
2008-0-03-0-08-CM-007441,http://panamacompra.gob.pa/Inicio/#!/vistaPreviaCP?NumLc=2008-0-03-0-08-CM-007441,Adjudicado,Ministerio De La Presidencia,BOLETO AEREO,SEDE,,,"Compra Menor de B/. 1,000",Servicio,19-10-2017,31-07-2008 12:50 PM,,,,,,,,---,Global,PANAMÁ,Edisa Cuesta,Cotizador,527-9850,ecuesta@presidencia.gob.pa,"MUNDIAL DE VIAJES, S.A.",3713-117-53609-18,AVE. BALBOA EDIF. BALBOA PLAZA-LOCAL Nº105,PANAMÁ,Panamá,,269-6515
2008-0-03-0-08-CD-000879,http://panamacompra.gob.pa/Inicio/#!/vistaPreviaCP?NumLc=2008-0-03-0-08-CD-000879,Autorizado,Ministerio De La Presidencia,EN CONCEPTO DE PUBLICIDAD RADIAL,SEDE,,,Contratación Directa(CD),Servicio,19-10-2017,04-07-2008 12:32 PM,,,,,,,,---,,,Gloria Jimenez,Jefa de Compras,527-9850,gjimenez@presidencia.gob.pa,RADIO ESTEREO MI FAVORITA,60114-2-346008-81,"CALLE DAMIAN CARLES, EDIFICIO JUANA MARTA, PRIMER ALTO",COCLÉ,Penonomé,mifavoritaradio@hotmail.com,997-1386
2008-0-03-0-08-CD-000878,http://panamacompra.gob.pa/Inicio/#!/vistaPreviaCP?NumLc=2008-0-03-0-08-CD-000878,Autorizado,Ministerio De La Presidencia,EN CONCEPTO DE PUBLICIDAD RADIAL,SEDE,,,Contratación Directa(CD),Servicio,19-10-2017,04-07-2008 12:31 PM,,,,,,,,---,,,Gloria Jimenez,Jefa de Compras,527-9850,gjimenez@presidencia.gob.pa,"FRECUENCIAS ASOCIADAS, S.A.             WAO 97 1/2",46967-141-305626-93,"CALLE 50 Y VIA BRASIL, EDIFICIO PLAZA 50",PANAMÁ,Balboa,dsamudio@grupofa.com,507-20978348
2008-0-03-0-08-CD-000877,http://panamacompra.gob.pa/Inicio/#!/vistaPreviaCP?NumLc=2008-0-03-0-08-CD-000877,Autorizado,Ministerio De La Presidencia,EN CONCEPTO DE PUBLICIDAD RADIAL,SEDE,,,Contratación Directa(CD),Servicio,19-10-2017,04-07-2008 12:30 PM,,,,,,,,---,,,Gloria Jimenez,Jefa de Compras,527-9850,gjimenez@presidencia.gob.pa,Kw Continente,28193-59-230559-65,"Edificio CARRILLON, VIA ARGENTINA",PANAMÁ,Panamá,kwcontinenteconta@hotmail.com,507-2230889
2008-0-03-0-08-CD-000876,http://panamacompra.gob.pa/Inicio/#!/vistaPreviaCP?NumLc=2008-0-03-0-08-CD-000876,Autorizado,Ministerio De La Presidencia,EN CONCEPTO DE PUBLICIDAD RADIAL,SEDE,,,Contratación Directa(CD),Servicio,19-10-2017,04-07-2008 12:29 PM,,,,,,,,---,,,Gloria Jimenez,Jefa de Compras,527-9850,gjimenez@presidencia.gob.pa,"RADIO DIFUSION Y COMUNICACION, S.A.",34401-28-255957-42,"CL.50 Y VIA BRASIL-PH PLAZA 50, PISO 6",PANAMÁ,Balboa,radiomia@cableonda.net,507-2630140
2008-0-03-0-08-CD-000875,http://panamacompra.gob.pa/Inicio/#!/vistaPreviaCP?NumLc=2008-0-03-0-08-CD-000875,Autorizado,Ministerio De La Presidencia,ALQUILER DE VEHICULOS,SEDE,,,Contratación Directa(CD),Servicio,19-10-2017,04-07-2008 11:48 AM,,,,,,,,---,,,Martha Miranda,Compra,514 0000/03,cspdn_admin@cwpanama.net,DOLLAR RENT A CAR,419758-1-427175-97,TUMBA MUERTO AVE RICARDO J ALFARO,PANAMÁ,Panamá,mariae.delaguardia@automarketpan.com,507-2366785
2008-0-03-0-08-CD-000874,http://panamacompra.gob.pa/Inicio/#!/vistaPreviaCP?NumLc=2008-0-03-0-08-CD-000874,Autorizado,Ministerio De La Presidencia,POR TRABAJOS REALIZADOS EN LA ANTIGUA MARINA (DIGEMAC),SEDE,,,Contratación Directa(CD),Bien,19-10-2017,04-07-2008 10:39 AM,,,,,,,,---,,,Gloria Jimenez,Jefa de Compras,527-9850,gjimenez@presidencia.gob.pa,ORIEL CAICEDO,5-10-202-,JUAN DIAZ CALLE PRINCIPAL LAS ACACIAS CASA 409,PANAMÁ,Panamá,ORIEL@HOTMAIL.COM,2667704
2008-0-03-0-08-CD-000873,http://panamacompra.gob.pa/Inicio/#!/vistaPreviaCP?NumLc=2008-0-03-0-08-CD-000873,Autorizado,Ministerio De La Presidencia,ALQUILER DE PLANTA ELECTRICA,SEDE,,,Contratación Directa(CD),Servicio,19-10-2017,03-07-2008 10:11 AM,,,,,,,,---,,,Gloria Jimenez,Jefa de Compras,527-9850,gjimenez@presidencia.gob.pa,"CARDOZE & LINDO, S.A.  (Sucursal Veraguas)",122-395-32518-95,LOS BOQUERONES DE SANTIAGO,VERAGUAS,Atalaya,carrasco_karla@carlindocat.com.pa,507-2749300
2008-0-03-0-08-CD-000872,http://panamacompra.gob.pa/Inicio/#!/vistaPreviaCP?NumLc=2008-0-03-0-08-CD-000872,Autorizado,Ministerio De La Presidencia,PAGO DE SERVICIO DE TELEFONIA CELULAR,SEDE,,,Contratación Directa(CD),Servicio,19-10-2017,02-07-2008 01:57 PM,,,,,,,,---,,,Gloria Jimenez,Jefa de Compras,527-9850,gjimenez@presidencia.gob.pa,"EcoHabitat, S.A.",637677-1-457460-03,"calle 48 y Uruguay, Bella Vista",PANAMÁ,Panamá,ecohabitat.panama@gmail.com,507-2148284
2008-0-03-0-08-CD-000871,http://panamacompra.gob.pa/Inicio/#!/vistaPreviaCP?NumLc=2008-0-03-0-08-CD-000871,Autorizado,Ministerio De La Presidencia,BOLETO AEREO,SEDE,,,Contratación Directa(CD),Servicio,19-10-2017,02-07-2008 01:50 PM,,,,,,,,---,,,Gloria Jimenez,Jefa de Compras,527-9850,gjimenez@presidencia.gob.pa,"MUNDIAL DE VIAJES, S.A.",3713-117-53609-18,AVE. BALBOA EDIF. BALBOA PLAZA-LOCAL Nº105,PANAMÁ,Panamá,,269-6515
2008-0-03-0-08-CD-000870,http://panamacompra.gob.pa/Inicio/#!/vistaPreviaCP?NumLc=2008-0-03-0-08-CD-000870,Autorizado,Ministerio De La Presidencia,PAGO POR EL SUMINISTRO DE BONOS,SEDE,,,Contratación Directa(CD),Bien,19-10-2017,02-07-2008 09:04 AM,,,,,,,,---,,,Gloria Jimenez,Jefa de Compras,527-9850,gjimenez@presidencia.gob.pa,RIBA SMITH. S.A.,34201-3-055004-50,"URB HERBURGER, VIA SIMON BOLIVAR",PANAMÁ,Panamá,,229-4543